{"text_format":"1","workbook":"xlsx","n_sheets":7,"sheets":["Ditte","Metodo a","Metodo b","Metodo c","Metodo d","Metodo e","Max Rib"],"not_rendered":{"charts":0,"images":0,"macros":1,"external_links":0,"defined_names":5,"comments":0,"pivot_tables":0},"unopened":[],"bounds":{"document_bytes":16777216,"sheet_cells":100000,"rows_first":2000,"rows_last":500,"rows_between":2000,"halvings":0,"cell_chars":16384,"cell_head_chars":4096},"cells_cut":0,"cells_raw":0,"read":"whole","date_system":"1900"}

{"sheet":"Ditte","index":0,"n_rows":36,"n_cols":9,"rows_kept":36,"cut":false,"hidden":false,"merged":[[1,0,1,8]]}
[null,"INIZIO ORE   10:40",null,"Stralcio del verbale di gara ",null,null,null,"DATA","2017-10-27"]
["LEGGE 191/2009 - TERZO ACCORDO DI PROGRAMMA - COD. 1ER1126 - COMUNE DI VENTASSO (RE) - LAVORI DI CONSOLIDAMENTO E MESSA IN SICUREZZA DEL SETTORE OVEST DEL DISSESTO IDROGEOLOGICO CHE COINVOLGE L'ABITATO DI TAVIANO"]
[null,"Offerte pervenute",{"$f":"COUNTA(B6:B86)","v":19}]
[null,"Offerte regolari ",{"$f":"COUNT(A6:A86)","v":19}]
["N","Nome Ditta",null,"Ribasso %",null,null,null,"Valore appalto",349969.48]
[1,"CEIS SRL",null,1.111E-2,null,null,null,"Oneri per la sicurezza",2968]
[{"$f":"IF(OR(B7=\"\",D7=\"\"),\"\",A6+1)","v":2},"MONTANA VALLE DEL LAMONE",null,5.9900000000000002E-2,null,null,null,"Lavori sogg. ribasso",{"$f":"I5-I6","v":347001.48}]
[{"$f":"IF(OR(B8=\"\",D8=\"\"),\"\",IF(A7=\"\",COUNT($A$6:A7)+1,A7+1))","v":3},"BERTI SISTO",null,0.13844000000000001]
[{"$f":"IF(OR(B9=\"\",D9=\"\"),\"\",IF(A8=\"\",COUNT($A$6:A8)+1,A8+1))","v":4},"ITALSCAVI SPA",null,0.1401]
[{"$f":"IF(OR(B10=\"\",D10=\"\"),\"\",IF(A9=\"\",COUNT($A$6:A9)+1,A9+1))","v":5},"AMBROGETTI SRL",null,0.14132]
[{"$f":"IF(OR(B11=\"\",D11=\"\"),\"\",IF(A10=\"\",COUNT($A$6:A10)+1,A10+1))","v":6},"GAETTI COSTRUZIONI SRL",null,0.15334]
[{"$f":"IF(OR(B12=\"\",D12=\"\"),\"\",IF(A11=\"\",COUNT($A$6:A11)+1,A11+1))","v":7},"L.S. NORD SRL",null,0.15573000000000001,null,null,null,"Estrazione del lotto del","2017-10-26"]
[{"$f":"IF(OR(B13=\"\",D13=\"\"),\"\",IF(A12=\"\",COUNT($A$6:A12)+1,A12+1))","v":8},"EDILIZIA DEL COM.BELLI",null,0.15694,null,null,null,"Seme generatore 1° estratto ruota di Bari n.",16]
[{"$f":"IF(OR(B14=\"\",D14=\"\"),\"\",IF(A13=\"\",COUNT($A$6:A13)+1,A13+1))","v":9},"ZANNINI",null,0.16098999999999999,null,null,null,"Metodo sorteggiato  art. 97 DLGS n. 50/16","B)"]
[{"$f":"IF(OR(B15=\"\",D15=\"\"),\"\",IF(A14=\"\",COUNT($A$6:A14)+1,A14+1))","v":10},"COAF SOC.COOP",null,0.1613]
[{"$f":"IF(OR(B16=\"\",D16=\"\"),\"\",IF(A15=\"\",COUNT($A$6:A15)+1,A15+1))","v":11},"CORMA CONS.",null,0.16413,null,null,null,"PRESIDENTE DI GARA"]
[{"$f":"IF(OR(B17=\"\",D17=\"\"),\"\",IF(A16=\"\",COUNT($A$6:A16)+1,A16+1))","v":12},"CSA CONS. SERVIZI APPALTI",null,0.16771,null,null,null,"Ing. Francesco Capuano"]
[{"$f":"IF(OR(B18=\"\",D18=\"\"),\"\",IF(A17=\"\",COUNT($A$6:A17)+1,A17+1))","v":13},"CAMAR SOC. COOP.",null,0.18551999999999999]
[{"$f":"IF(OR(B19=\"\",D19=\"\"),\"\",IF(A18=\"\",COUNT($A$6:A18)+1,A18+1))","v":14},"CME ",null,0.18887999999999999]
[{"$f":"IF(OR(B20=\"\",D20=\"\"),\"\",IF(A19=\"\",COUNT($A$6:A19)+1,A19+1))","v":15},"FRATELLI DI CARLO SRL",null,0.19900000000000001]
[{"$f":"IF(OR(B21=\"\",D21=\"\"),\"\",IF(A20=\"\",COUNT($A$6:A20)+1,A20+1))","v":16},"GRENTI SRL",null,0.19991999999999999]
[{"$f":"IF(OR(B22=\"\",D22=\"\"),\"\",IF(A21=\"\",COUNT($A$6:A21)+1,A21+1))","v":17},"EDIL DUE SRL",null,0.20250000000000001]
[{"$f":"IF(OR(B23=\"\",D23=\"\"),\"\",IF(A22=\"\",COUNT($A$6:A22)+1,A22+1))","v":18},"CFC COSTRUZIONI",null,0.21376999999999999]
[{"$f":"IF(OR(B24=\"\",D24=\"\"),\"\",IF(A23=\"\",COUNT($A$6:A23)+1,A23+1))","v":19},"CIPAR SRL",null,0.22259999999999999]
[{"$f":"IF(OR(B25=\"\",D25=\"\"),\"\",IF(A24=\"\",COUNT($A$6:A24)+1,A24+1))","v":""}]
[{"$f":"IF(OR(B26=\"\",D26=\"\"),\"\",IF(A25=\"\",COUNT($A$6:A25)+1,A25+1))","v":""}]
[{"$f":"IF(OR(B27=\"\",D27=\"\"),\"\",IF(A26=\"\",COUNT($A$6:A26)+1,A26+1))","v":""}]
[{"$f":"IF(OR(B28=\"\",D28=\"\"),\"\",IF(A27=\"\",COUNT($A$6:A27)+1,A27+1))","v":""}]
[{"$f":"IF(OR(B29=\"\",D29=\"\"),\"\",IF(A28=\"\",COUNT($A$6:A28)+1,A28+1))","v":""}]
[{"$f":"IF(OR(B30=\"\",D30=\"\"),\"\",IF(A29=\"\",COUNT($A$6:A29)+1,A29+1))","v":""}]
[{"$f":"IF(OR(B31=\"\",D31=\"\"),\"\",IF(A30=\"\",COUNT($A$6:A30)+1,A30+1))","v":""}]
[{"$f":"IF(OR(B32=\"\",D32=\"\"),\"\",IF(A31=\"\",COUNT($A$6:A31)+1,A31+1))","v":""}]
[{"$f":"IF(OR(B33=\"\",D33=\"\"),\"\",IF(A32=\"\",COUNT($A$6:A32)+1,A32+1))","v":""}]
[{"$f":"IF(OR(B34=\"\",D34=\"\"),\"\",IF(A33=\"\",COUNT($A$6:A33)+1,A33+1))","v":""}]
[{"$f":"IF(OR(B35=\"\",D35=\"\"),\"\",IF(A34=\"\",COUNT($A$6:A34)+1,A34+1))","v":""}]
[{"$f":"IF(OR(B36=\"\",D36=\"\"),\"\",IF(A35=\"\",COUNT($A$6:A35)+1,A35+1))","v":""}]

{"sheet":"Metodo a","index":1,"n_rows":35,"n_cols":13,"rows_kept":35,"cut":false,"hidden":false,"merged":[[1,0,1,12],[14,11,14,12]]}
[null,null,{"$f":"Ditte!B1","v":"INIZIO ORE   10:40"},"Stralcio del verbale di gara",null,null,null,null,null,null,null,"DATA",{"$f":"Ditte!I1","v":"2017-10-27"}]
[{"$f":"Ditte!A2","v":"LEGGE 191/2009 - TERZO ACCORDO DI PROGRAMMA - COD. 1ER1126 - COMUNE DI VENTASSO (RE) - LAVORI DI CONSOLIDAMENTO E MESSA IN SICUREZZA DEL SETTORE OVEST DEL DISSESTO IDROGEOLOGICO CHE COINVOLGE L'ABITATO DI TAVIANO"}]
[null,null,"Offerte pervenute",{"$f":"Ditte!C3","v":19},null,null,null,null,null,null,null,{"$f":"Ditte!H12","v":"Estrazione del lotto del"},{"$f":"Ditte!I12","v":"2017-10-26"}]
[null,null,"Offerte regolari ",{"$f":"Ditte!C4","v":19},null,null,null,null,null,null,null,{"$f":"Ditte!H13","v":"Seme generatore 1° estratto ruota di Bari n."},{"$f":"Ditte!I13","v":16}]
["N",null,"Nome Ditta","Ribasso %","Importo offerto","Valide","Scostamento","Offerte Ammesse",null,null,null,{"$f":"Ditte!H14","v":"Metodo sorteggiato  art. 97 DLGS n. 50/16"},{"$f":"Ditte!I14","v":"B)"}]
[{"$f":"IF(Ditte!A6>=1,Ditte!A6,\"  \")","v":1},{"$f":"H6","v":" "},{"$f":"IF(Ditte!B6=0,\" \",Ditte!B6)","v":"CEIS SRL"},{"$f":"IF(Ditte!D6=0,\" \",Ditte!D6)","v":1.111E-2},{"$f":"IF(D6=\" \",\" \",$M$8*(1-D6)+$M$7)","v":346114.29},{"$f":"IF(AND(A6>$M$18,A6<=(COUNT($A:$A)-$M$18)),D6,\" \")","v":" "},{"$f":"IF(F6=\" \",\" \",IF(F6>=MediaR,F6-MediaR,\"\"))","v":" "},{"$f":"IF(F6=\" \",\" \",IF(F6<MediaF,F6,\"Anomala\"))","v":" "},{"$f":"IF(H6=Vincitore,\"PROPOSTA DI AGGIUDICAZIONE\",\"\")","v":""}]
[{"$f":"IF(Ditte!A7>=1,Ditte!A7,\"  \")","v":2},{"$f":"H7","v":" "},{"$f":"IF(Ditte!B7=0,\" \",Ditte!B7)","v":"MONTANA VALLE DEL LAMONE"},{"$f":"IF(Ditte!D7=0,\" \",Ditte!D7)","v":5.9900000000000002E-2},329184.09000000003,{"$f":"IF(AND(A7>$M$18,A7<=(COUNT($A:$A)-$M$18)),D7,\" \")","v":" "}," "," ","",null,null,"Oneri per la sicurezza",{"$f":"Ditte!I6","v":2968}]
[{"$f":"IF(Ditte!A8>=1,Ditte!A8,\"  \")","v":3}," ",{"$f":"IF(Ditte!B8=0,\" \",Ditte!B8)","v":"BERTI SISTO"},{"$f":"IF(Ditte!D8=0,\" \",Ditte!D8)","v":0.13844000000000001},301930.59999999998," "," "," ","",null,null,"Lavori sogg. ribasso",{"$f":"M9-M7","v":347001.48}]
[{"$f":"IF(Ditte!A9>=1,Ditte!A9,\"  \")","v":4}," ",{"$f":"IF(Ditte!B9=0,\" \",Ditte!B9)","v":"ITALSCAVI SPA"},{"$f":"IF(Ditte!D9=0,\" \",Ditte!D9)","v":0.1401},301354.57," "," "," ","",null,null,"Valore appalto",{"$f":"Ditte!I5","v":349969.48}]
[{"$f":"IF(Ditte!A10>=1,Ditte!A10,\"  \")","v":5},0.14132,{"$f":"IF(Ditte!B10=0,\" \",Ditte!B10)","v":"AMBROGETTI SRL"},{"$f":"IF(Ditte!D10=0,\" \",Ditte!D10)","v":0.14132},300931.23,0.14132,"",0.14132,"",null,null,"Media ribasso valido",{"$f":"AVERAGE(F:F)","v":0.1668055}]
[{"$f":"IF(Ditte!A11>=1,Ditte!A11,\"  \")","v":6},0.15334,{"$f":"IF(Ditte!B11=0,\" \",Ditte!B11)","v":"GAETTI COSTRUZIONI SRL"},{"$f":"IF(Ditte!D11=0,\" \",Ditte!D11)","v":0.15334},296760.27,0.15334,"",0.15334,"",null,null,"Media scostamenti",{"$f":"AVERAGE(G:G)","v":1.8471999999999999E-2}]
[{"$f":"IF(Ditte!A12>=1,Ditte!A12,\"  \")","v":7},0.15573000000000001,{"$f":"IF(Ditte!B12=0,\" \",Ditte!B12)","v":"L.S. NORD SRL"},{"$f":"IF(Ditte!D12=0,\" \",Ditte!D12)","v":0.15573000000000001},295930.94,0.15573000000000001,"",0.15573000000000001,"",null,null,"Soglia anomalia",{"$f":"MediaR+MediaS","v":0.18527750000000001}]
[{"$f":"IF(Ditte!A13>=1,Ditte!A13,\"  \")","v":8},0.15694,{"$f":"IF(Ditte!B13=0,\" \",Ditte!B13)","v":"EDILIZIA DEL COM.BELLI"},{"$f":"IF(Ditte!D13=0,\" \",Ditte!D13)","v":0.15694},295511.07,0.15694,"",0.15694,"",null,null,"% PROPOSTA DI AGGIUDICAZIONE",{"$f":"MAX(H:H)","v":0.16771}]
[{"$f":"IF(Ditte!A14>=1,Ditte!A14,\"  \")","v":9},0.16098999999999999,{"$f":"IF(Ditte!B14=0,\" \",Ditte!B14)","v":"ZANNINI"},{"$f":"IF(Ditte!D14=0,\" \",Ditte!D14)","v":0.16098999999999999},294105.71000000002,0.16098999999999999,"",0.16098999999999999,"",null,null,"Nome ditta PROPOSTA DI AGGIUDICAZIONE"]
[{"$f":"IF(Ditte!A15>=1,Ditte!A15,\"  \")","v":10},0.1613,{"$f":"IF(Ditte!B15=0,\" \",Ditte!B15)","v":"COAF SOC.COOP"},{"$f":"IF(Ditte!D15=0,\" \",Ditte!D15)","v":0.1613},293998.14,0.1613,"",0.1613,"",null,null,{"$f":"IF(COUNTA(I6:I35)-COUNTBLANK(I6:I35)=1,VLOOKUP(Vincitore,B6:C35,2),\"C'E' PIU' DI UNA AGGIUDICAZIONE PROVVISORIA\")","v":"CSA CONS. SERVIZI APPALTI"}]
[{"$f":"IF(Ditte!A16>=1,Ditte!A16,\"  \")","v":11},0.16413,{"$f":"IF(Ditte!B16=0,\" \",Ditte!B16)","v":"CORMA CONS."},{"$f":"IF(Ditte!D16=0,\" \",Ditte!D16)","v":0.16413},293016.13,0.16413,"",0.16413,""]
[{"$f":"IF(Ditte!A17>=1,Ditte!A17,\"  \")","v":12},0.16771,{"$f":"IF(Ditte!B17=0,\" \",Ditte!B17)","v":"CSA CONS. SERVIZI APPALTI"},{"$f":"IF(Ditte!D17=0,\" \",Ditte!D17)","v":0.16771},291773.86,0.16771,9.0450000000000003E-4,0.16771,"PROPOSTA DI AGGIUDICAZIONE"]
[{"$f":"IF(Ditte!A18>=1,Ditte!A18,\"  \")","v":13},"Anomala",{"$f":"IF(Ditte!B18=0,\" \",Ditte!B18)","v":"CAMAR SOC. COOP."},{"$f":"IF(Ditte!D18=0,\" \",Ditte!D18)","v":0.18551999999999999},285593.77,0.18551999999999999,1.8714499999999998E-2,"Anomala","",null,null,"ALI     N.",{"$f":"CEILING(0.2*COUNT(A:A),1)","v":4}]
[{"$f":"IF(Ditte!A19>=1,Ditte!A19,\"  \")","v":14},"Anomala",{"$f":"IF(Ditte!B19=0,\" \",Ditte!B19)","v":"CME "},{"$f":"IF(Ditte!D19=0,\" \",Ditte!D19)","v":0.18887999999999999},284427.84000000003,0.18887999999999999,2.20745E-2,"Anomala",""]
[{"$f":"IF(Ditte!A20>=1,Ditte!A20,\"  \")","v":15},"Anomala",{"$f":"IF(Ditte!B20=0,\" \",Ditte!B20)","v":"FRATELLI DI CARLO SRL"},{"$f":"IF(Ditte!D20=0,\" \",Ditte!D20)","v":0.19900000000000001},280916.19,0.19900000000000001,3.2194500000000001E-2,"Anomala",""]
[{"$f":"IF(Ditte!A21>=1,Ditte!A21,\"  \")","v":16}," ",{"$f":"IF(Ditte!B21=0,\" \",Ditte!B21)","v":"GRENTI SRL"},{"$f":"IF(Ditte!D21=0,\" \",Ditte!D21)","v":0.19991999999999999},280596.94," "," "," ",""]
[{"$f":"IF(Ditte!A22>=1,Ditte!A22,\"  \")","v":17}," ",{"$f":"IF(Ditte!B22=0,\" \",Ditte!B22)","v":"EDIL DUE SRL"},{"$f":"IF(Ditte!D22=0,\" \",Ditte!D22)","v":0.20250000000000001},279701.68," "," "," ",""]
[{"$f":"IF(Ditte!A23>=1,Ditte!A23,\"  \")","v":18}," ",{"$f":"IF(Ditte!B23=0,\" \",Ditte!B23)","v":"CFC COSTRUZIONI"},{"$f":"IF(Ditte!D23=0,\" \",Ditte!D23)","v":0.21376999999999999},275790.96999999997," "," "," ",""]
[{"$f":"IF(Ditte!A24>=1,Ditte!A24,\"  \")","v":19}," ",{"$f":"IF(Ditte!B24=0,\" \",Ditte!B24)","v":"CIPAR SRL"},{"$f":"IF(Ditte!D24=0,\" \",Ditte!D24)","v":0.22259999999999999},272726.95," "," "," ","",null,null,{"$f":"Ditte!H16","v":"PRESIDENTE DI GARA"}]
[{"$f":"IF(Ditte!A25>=1,Ditte!A25,\"  \")","v":""}," ",{"$f":"IF(Ditte!B25=0,\" \",Ditte!B25)","v":" "},{"$f":"IF(Ditte!D25=0,\" \",Ditte!D25)","v":" "}," "," "," "," ","",null,null,{"$f":"Ditte!H17","v":"Ing. Francesco Capuano"}]
[{"$f":"IF(Ditte!A26>=1,Ditte!A26,\"  \")","v":""}," ",{"$f":"IF(Ditte!B26=0,\" \",Ditte!B26)","v":" "},{"$f":"IF(Ditte!D26=0,\" \",Ditte!D26)","v":" "}," "," "," "," ",""]
[{"$f":"IF(Ditte!A27>=1,Ditte!A27,\"  \")","v":""}," ",{"$f":"IF(Ditte!B27=0,\" \",Ditte!B27)","v":" "},{"$f":"IF(Ditte!D27=0,\" \",Ditte!D27)","v":" "}," "," "," "," ",""]
[{"$f":"IF(Ditte!A28>=1,Ditte!A28,\"  \")","v":""}," ",{"$f":"IF(Ditte!B28=0,\" \",Ditte!B28)","v":" "},{"$f":"IF(Ditte!D28=0,\" \",Ditte!D28)","v":" "}," "," "," "," ",""]
[{"$f":"IF(Ditte!A29>=1,Ditte!A29,\"  \")","v":""}," ",{"$f":"IF(Ditte!B29=0,\" \",Ditte!B29)","v":" "},{"$f":"IF(Ditte!D29=0,\" \",Ditte!D29)","v":" "}," "," "," "," ",""]
[{"$f":"IF(Ditte!A30>=1,Ditte!A30,\"  \")","v":""}," ",{"$f":"IF(Ditte!B30=0,\" \",Ditte!B30)","v":" "},{"$f":"IF(Ditte!D30=0,\" \",Ditte!D30)","v":" "}," "," "," "," ",""]
[{"$f":"IF(Ditte!A31>=1,Ditte!A31,\"  \")","v":""}," ",{"$f":"IF(Ditte!B31=0,\" \",Ditte!B31)","v":" "},{"$f":"IF(Ditte!D31=0,\" \",Ditte!D31)","v":" "}," "," "," "," ",""]
[{"$f":"IF(Ditte!A32>=1,Ditte!A32,\"  \")","v":""}," ",{"$f":"IF(Ditte!B32=0,\" \",Ditte!B32)","v":" "},{"$f":"IF(Ditte!D32=0,\" \",Ditte!D32)","v":" "}," "," "," "," ",""]
[{"$f":"IF(Ditte!A33>=1,Ditte!A33,\"  \")","v":""}," ",{"$f":"IF(Ditte!B33=0,\" \",Ditte!B33)","v":" "},{"$f":"IF(Ditte!D33=0,\" \",Ditte!D33)","v":" "}," "," "," "," ",""]
[{"$f":"IF(Ditte!A34>=1,Ditte!A34,\"  \")","v":""}," ",{"$f":"IF(Ditte!B34=0,\" \",Ditte!B34)","v":" "},{"$f":"IF(Ditte!D34=0,\" \",Ditte!D34)","v":" "}," "," "," "," ",""]
[{"$f":"IF(Ditte!A35>=1,Ditte!A35,\"  \")","v":""},{"$f":"H35","v":" "},{"$f":"IF(Ditte!B35=0,\" \",Ditte!B35)","v":" "},{"$f":"IF(Ditte!D35=0,\" \",Ditte!D35)","v":" "},{"$f":"IF(D35=\" \",\" \",$M$8*(1-D35)+$M$7)","v":" "},{"$f":"IF(AND(A35>$M$18,A35<=(COUNT($A:$A)-$M$18)),D35,\" \")","v":" "},{"$f":"IF(F35=\" \",\" \",IF(F35>=MediaR,F35-MediaR,\"\"))","v":" "},{"$f":"IF(F35=\" \",\" \",IF(F35<MediaF,F35,\"Anomala\"))","v":" "},""]

{"sheet":"Metodo b","index":2,"n_rows":35,"n_cols":12,"rows_kept":35,"cut":false,"hidden":false,"merged":[[1,0,1,11],[15,10,15,11]]}
[null,null,{"$f":"Ditte!B1","v":"INIZIO ORE   10:40"},"Stralcio del verbale di gara",null,null,null,null,null,null,"DATA",{"$f":"Ditte!I1","v":"2017-10-27"}]
[{"$f":"Ditte!A2","v":"LEGGE 191/2009 - TERZO ACCORDO DI PROGRAMMA - COD. 1ER1126 - COMUNE DI VENTASSO (RE) - LAVORI DI CONSOLIDAMENTO E MESSA IN SICUREZZA DEL SETTORE OVEST DEL DISSESTO IDROGEOLOGICO CHE COINVOLGE L'ABITATO DI TAVIANO"}]
[null,null,"Offerte pervenute",{"$f":"Ditte!C3","v":19},null,null,null,null,null,null,{"$f":"Ditte!H12","v":"Estrazione del lotto del"},{"$f":"Ditte!I12","v":"2017-10-26"}]
[null,null,"Offerte regolari ",{"$f":"Ditte!C4","v":19},null,null,null,null,null,null,{"$f":"Ditte!H13","v":"Seme generatore 1° estratto ruota di Bari n."},{"$f":"Ditte!I13","v":16}]
["N",null,"Nome Ditta","Ribasso %","Importo offerto","Valide","Offerte Ammesse",null,null,null,{"$f":"Ditte!H14","v":"Metodo sorteggiato  art. 97 DLGS n. 50/16"},{"$f":"Ditte!I14","v":"B)"}]
[{"$f":"IF(Ditte!A6>=1,Ditte!A6,\"  \")","v":1},{"$f":"G6","v":" "},{"$f":"IF(Ditte!B6=0,\" \",Ditte!B6)","v":"CEIS SRL"},{"$f":"IF(Ditte!D6=0,\" \",Ditte!D6)","v":1.111E-2},{"$f":"IF(D6=\" \",\" \",$L$8*(1-D6)+$L$7)","v":346114.29},{"$f":"IF(AND(A6>$L$18,A6<=(COUNT($A:$A)-$L$18)),D6,\" \")","v":" "},{"$f":"IF(F6=\" \",\" \",IF(F6<$L$13,F6,\"Anomala\"))","v":" "},{"$f":"IF(G6=$L$14,\"PROPOSTA DI AGGIUDICAZIONE\",\"\")","v":""},null,null,null,{"$f":"(L10*100-INT(L10*100))*10","v":4.8600000000000003}]
[{"$f":"IF(Ditte!A7>=1,Ditte!A7,\"  \")","v":2},{"$f":"G7","v":" "},{"$f":"IF(Ditte!B7=0,\" \",Ditte!B7)","v":"MONTANA VALLE DEL LAMONE"},{"$f":"IF(Ditte!D7=0,\" \",Ditte!D7)","v":5.9900000000000002E-2},{"$f":"IF(D7=\" \",\" \",$L$8*(1-D7)+$L$7)","v":329184.09000000003},{"$f":"IF(AND(A7>$L$18,A7<=(COUNT($A:$A)-$L$18)),D7,\" \")","v":" "}," ",{"$f":"IF(G7=$L$14,\"PROPOSTA DI AGGIUDICAZIONE\",\"\")","v":""},null,null,"Oneri per la sicurezza",{"$f":"Ditte!I6","v":2968}]
[{"$f":"IF(Ditte!A8>=1,Ditte!A8,\"  \")","v":3},{"$f":"G8","v":" "},{"$f":"IF(Ditte!B8=0,\" \",Ditte!B8)","v":"BERTI SISTO"},{"$f":"IF(Ditte!D8=0,\" \",Ditte!D8)","v":0.13844000000000001},{"$f":"IF(D8=\" \",\" \",$L$8*(1-D8)+$L$7)","v":301930.59999999998}," "," ",{"$f":"IF(G8=$L$14,\"PROPOSTA DI AGGIUDICAZIONE\",\"\")","v":""},null,null,"Lavori sogg. ribasso",{"$f":"L9-L7","v":347001.48}]
[{"$f":"IF(Ditte!A9>=1,Ditte!A9,\"  \")","v":4}," ",{"$f":"IF(Ditte!B9=0,\" \",Ditte!B9)","v":"ITALSCAVI SPA"},{"$f":"IF(Ditte!D9=0,\" \",Ditte!D9)","v":0.1401},301354.57," "," ","",null,null,"Valore appalto",{"$f":"Ditte!I5","v":349969.48}]
[{"$f":"IF(Ditte!A10>=1,Ditte!A10,\"  \")","v":5},0.14132,{"$f":"IF(Ditte!B10=0,\" \",Ditte!B10)","v":"AMBROGETTI SRL"},{"$f":"IF(Ditte!D10=0,\" \",Ditte!D10)","v":0.14132},300931.23,0.14132,0.14132,"",null,null,"Somma ribassi validi",{"$f":"SUM(F:F)","v":1.8348599999999999}]
[{"$f":"IF(Ditte!A11>=1,Ditte!A11,\"  \")","v":6},0.15334,{"$f":"IF(Ditte!B11=0,\" \",Ditte!B11)","v":"GAETTI COSTRUZIONI SRL"},{"$f":"IF(Ditte!D11=0,\" \",Ditte!D11)","v":0.15334},296760.27,0.15334,0.15334,"",null,null,"Media ribasso valido",{"$f":"AVERAGE(F:F)","v":0.1668055}]
[{"$f":"IF(Ditte!A12>=1,Ditte!A12,\"  \")","v":7},0.15573000000000001,{"$f":"IF(Ditte!B12=0,\" \",Ditte!B12)","v":"L.S. NORD SRL"},{"$f":"IF(Ditte!D12=0,\" \",Ditte!D12)","v":0.15573000000000001},295930.94,0.15573000000000001,0.15573000000000001,"",null,null,"Decremento",{"$f":"IF(OR(INT(L6)=1,INT(L6)=3,INT(L6)=5,INT(L6)=7,INT(L6)=9),INT(L6)/100,0)","v":0}]
[{"$f":"IF(Ditte!A13>=1,Ditte!A13,\"  \")","v":8},0.15694,{"$f":"IF(Ditte!B13=0,\" \",Ditte!B13)","v":"EDILIZIA DEL COM.BELLI"},{"$f":"IF(Ditte!D13=0,\" \",Ditte!D13)","v":0.15694},295511.07,0.15694,0.15694,"",null,null,"Soglia anomalia",{"$f":"L11-(L11*L12)","v":0.1668055}]
[{"$f":"IF(Ditte!A14>=1,Ditte!A14,\"  \")","v":9},0.16098999999999999,{"$f":"IF(Ditte!B14=0,\" \",Ditte!B14)","v":"ZANNINI"},{"$f":"IF(Ditte!D14=0,\" \",Ditte!D14)","v":0.16098999999999999},294105.71000000002,0.16098999999999999,0.16098999999999999,"",null,null,"% PROPOSTA DI AGGIUDICAZIONE",{"$f":"MAX(G:G)","v":0.16413}]
[{"$f":"IF(Ditte!A15>=1,Ditte!A15,\"  \")","v":10},0.1613,{"$f":"IF(Ditte!B15=0,\" \",Ditte!B15)","v":"COAF SOC.COOP"},{"$f":"IF(Ditte!D15=0,\" \",Ditte!D15)","v":0.1613},293998.14,0.1613,0.1613,"",null,null,"Nome ditta PROPOSTA DI AGGIUDICAZIONE"]
[{"$f":"IF(Ditte!A16>=1,Ditte!A16,\"  \")","v":11},0.16413,{"$f":"IF(Ditte!B16=0,\" \",Ditte!B16)","v":"CORMA CONS."},{"$f":"IF(Ditte!D16=0,\" \",Ditte!D16)","v":0.16413},293016.13,0.16413,0.16413,"PROPOSTA DI AGGIUDICAZIONE",null,null,{"$f":"IF(COUNTA(H6:H35)-COUNTBLANK(H6:H35)=1,VLOOKUP(L14,B6:C35,2),\"C'E' PIU' DI UNA AGGIUDICAZIONE PROVVISORIA\")","v":"CORMA CONS."}]
[{"$f":"IF(Ditte!A17>=1,Ditte!A17,\"  \")","v":12},"Anomala",{"$f":"IF(Ditte!B17=0,\" \",Ditte!B17)","v":"CSA CONS. SERVIZI APPALTI"},{"$f":"IF(Ditte!D17=0,\" \",Ditte!D17)","v":0.16771},291773.86,0.16771,"Anomala",""]
[{"$f":"IF(Ditte!A18>=1,Ditte!A18,\"  \")","v":13},"Anomala",{"$f":"IF(Ditte!B18=0,\" \",Ditte!B18)","v":"CAMAR SOC. COOP."},{"$f":"IF(Ditte!D18=0,\" \",Ditte!D18)","v":0.18551999999999999},285593.77,0.18551999999999999,"Anomala","",null,null,"ALI     N.",{"$f":"CEILING(0.2*COUNT(A:A),1)","v":4}]
[{"$f":"IF(Ditte!A19>=1,Ditte!A19,\"  \")","v":14},"Anomala",{"$f":"IF(Ditte!B19=0,\" \",Ditte!B19)","v":"CME "},{"$f":"IF(Ditte!D19=0,\" \",Ditte!D19)","v":0.18887999999999999},284427.84000000003,0.18887999999999999,"Anomala",""]
[{"$f":"IF(Ditte!A20>=1,Ditte!A20,\"  \")","v":15},"Anomala",{"$f":"IF(Ditte!B20=0,\" \",Ditte!B20)","v":"FRATELLI DI CARLO SRL"},{"$f":"IF(Ditte!D20=0,\" \",Ditte!D20)","v":0.19900000000000001},280916.19,0.19900000000000001,"Anomala",""]
[{"$f":"IF(Ditte!A21>=1,Ditte!A21,\"  \")","v":16}," ",{"$f":"IF(Ditte!B21=0,\" \",Ditte!B21)","v":"GRENTI SRL"},{"$f":"IF(Ditte!D21=0,\" \",Ditte!D21)","v":0.19991999999999999},280596.94," "," ",""]
[{"$f":"IF(Ditte!A22>=1,Ditte!A22,\"  \")","v":17}," ",{"$f":"IF(Ditte!B22=0,\" \",Ditte!B22)","v":"EDIL DUE SRL"},{"$f":"IF(Ditte!D22=0,\" \",Ditte!D22)","v":0.20250000000000001},279701.68," "," ",""]
[{"$f":"IF(Ditte!A23>=1,Ditte!A23,\"  \")","v":18}," ",{"$f":"IF(Ditte!B23=0,\" \",Ditte!B23)","v":"CFC COSTRUZIONI"},{"$f":"IF(Ditte!D23=0,\" \",Ditte!D23)","v":0.21376999999999999},275790.96999999997," "," ",""]
[{"$f":"IF(Ditte!A24>=1,Ditte!A24,\"  \")","v":19}," ",{"$f":"IF(Ditte!B24=0,\" \",Ditte!B24)","v":"CIPAR SRL"},{"$f":"IF(Ditte!D24=0,\" \",Ditte!D24)","v":0.22259999999999999},272726.95," "," ","",null,null,{"$f":"Ditte!H16","v":"PRESIDENTE DI GARA"}]
[{"$f":"IF(Ditte!A25>=1,Ditte!A25,\"  \")","v":""}," ",{"$f":"IF(Ditte!B25=0,\" \",Ditte!B25)","v":" "},{"$f":"IF(Ditte!D25=0,\" \",Ditte!D25)","v":" "}," "," "," ","",null,null,{"$f":"Ditte!H17","v":"Ing. Francesco Capuano"}]
[{"$f":"IF(Ditte!A26>=1,Ditte!A26,\"  \")","v":""}," ",{"$f":"IF(Ditte!B26=0,\" \",Ditte!B26)","v":" "},{"$f":"IF(Ditte!D26=0,\" \",Ditte!D26)","v":" "}," "," "," ",""]
[{"$f":"IF(Ditte!A27>=1,Ditte!A27,\"  \")","v":""}," ",{"$f":"IF(Ditte!B27=0,\" \",Ditte!B27)","v":" "},{"$f":"IF(Ditte!D27=0,\" \",Ditte!D27)","v":" "}," "," "," ",""]
[{"$f":"IF(Ditte!A28>=1,Ditte!A28,\"  \")","v":""}," ",{"$f":"IF(Ditte!B28=0,\" \",Ditte!B28)","v":" "},{"$f":"IF(Ditte!D28=0,\" \",Ditte!D28)","v":" "}," "," "," ",""]
[{"$f":"IF(Ditte!A29>=1,Ditte!A29,\"  \")","v":""}," ",{"$f":"IF(Ditte!B29=0,\" \",Ditte!B29)","v":" "},{"$f":"IF(Ditte!D29=0,\" \",Ditte!D29)","v":" "}," "," "," ",""]
[{"$f":"IF(Ditte!A30>=1,Ditte!A30,\"  \")","v":""}," ",{"$f":"IF(Ditte!B30=0,\" \",Ditte!B30)","v":" "},{"$f":"IF(Ditte!D30=0,\" \",Ditte!D30)","v":" "}," "," "," ",""]
[{"$f":"IF(Ditte!A31>=1,Ditte!A31,\"  \")","v":""}," ",{"$f":"IF(Ditte!B31=0,\" \",Ditte!B31)","v":" "},{"$f":"IF(Ditte!D31=0,\" \",Ditte!D31)","v":" "}," "," "," ",""]
[{"$f":"IF(Ditte!A32>=1,Ditte!A32,\"  \")","v":""}," ",{"$f":"IF(Ditte!B32=0,\" \",Ditte!B32)","v":" "},{"$f":"IF(Ditte!D32=0,\" \",Ditte!D32)","v":" "}," "," "," ",""]
[{"$f":"IF(Ditte!A33>=1,Ditte!A33,\"  \")","v":""}," ",{"$f":"IF(Ditte!B33=0,\" \",Ditte!B33)","v":" "},{"$f":"IF(Ditte!D33=0,\" \",Ditte!D33)","v":" "}," "," "," ",""]
[{"$f":"IF(Ditte!A34>=1,Ditte!A34,\"  \")","v":""}," ",{"$f":"IF(Ditte!B34=0,\" \",Ditte!B34)","v":" "},{"$f":"IF(Ditte!D34=0,\" \",Ditte!D34)","v":" "}," "," "," ",""]
[{"$f":"IF(Ditte!A35>=1,Ditte!A35,\"  \")","v":""},{"$f":"G35","v":" "},{"$f":"IF(Ditte!B35=0,\" \",Ditte!B35)","v":" "},{"$f":"IF(Ditte!D35=0,\" \",Ditte!D35)","v":" "},{"$f":"IF(D35=\" \",\" \",$L$8*(1-D35)+$L$7)","v":" "},{"$f":"IF(AND(A35>$L$18,A35<=(COUNT($A:$A)-$L$18)),D35,\" \")","v":" "},{"$f":"IF(F35=\" \",\" \",IF(F35<$L$13,F35,\"Anomala\"))","v":" "},{"$f":"IF(G35=$L$14,\"PROPOSTA DI AGGIUDICAZIONE\",\"\")","v":""}]

{"sheet":"Metodo c","index":3,"n_rows":35,"n_cols":12,"rows_kept":35,"cut":false,"hidden":false,"merged":[[1,0,1,11],[14,10,14,11]]}
[null,null,{"$f":"Ditte!B1","v":"INIZIO ORE   10:40"},"Stralcio del verbale di gara",null,null,null,null,null,null,"DATA",{"$f":"Ditte!I1","v":"2017-10-27"}]
[{"$f":"Ditte!A2","v":"LEGGE 191/2009 - TERZO ACCORDO DI PROGRAMMA - COD. 1ER1126 - COMUNE DI VENTASSO (RE) - LAVORI DI CONSOLIDAMENTO E MESSA IN SICUREZZA DEL SETTORE OVEST DEL DISSESTO IDROGEOLOGICO CHE COINVOLGE L'ABITATO DI TAVIANO"}]
[null,null,"Offerte pervenute",{"$f":"Ditte!C3","v":19},null,null,null,null,null,null,{"$f":"Ditte!H12","v":"Estrazione del lotto del"},{"$f":"Ditte!I12","v":"2017-10-26"}]
[null,null,"Offerte regolari ",{"$f":"Ditte!C4","v":19},null,null,null,null,null,null,{"$f":"Ditte!H13","v":"Seme generatore 1° estratto ruota di Bari n."},{"$f":"Ditte!I13","v":16}]
["N",null,"Nome Ditta","Ribasso %","Importo offerto","Valide","Offerte Ammesse",null,null,null,{"$f":"Ditte!H14","v":"Metodo sorteggiato  art. 97 DLGS n. 50/16"},{"$f":"Ditte!I14","v":"B)"}]
[{"$f":"IF(Ditte!A6>=1,Ditte!A6,\"  \")","v":1},{"$f":"G6","v":1.111E-2},{"$f":"IF(Ditte!B6=0,\" \",Ditte!B6)","v":"CEIS SRL"},{"$f":"IF(Ditte!D6=0,\" \",Ditte!D6)","v":1.111E-2},{"$f":"IF(D6=\" \",\" \",$L$8*(1-D6)+$L$7)","v":346114.29},{"$f":"IF(AND(A6>$L$18,A6<=(COUNT($A:$A)-$L$18)),D6,\" \")","v":1.111E-2},{"$f":"IF(F6=\" \",\" \",IF(F6<$L$12,F6,\"Anomala\"))","v":1.111E-2},{"$f":"IF(G6=$L$13,\"PROPOSTA DI AGGIUDICAZIONE\",\"\")","v":""}]
[{"$f":"IF(Ditte!A7>=1,Ditte!A7,\"  \")","v":2},{"$f":"G7","v":5.9900000000000002E-2},{"$f":"IF(Ditte!B7=0,\" \",Ditte!B7)","v":"MONTANA VALLE DEL LAMONE"},{"$f":"IF(Ditte!D7=0,\" \",Ditte!D7)","v":5.9900000000000002E-2},329184.09000000003,5.9900000000000002E-2,{"$f":"IF(F7=\" \",\" \",IF(F7<$L$12,F7,\"Anomala\"))","v":5.9900000000000002E-2},{"$f":"IF(G7=$L$13,\"PROPOSTA DI AGGIUDICAZIONE\",\"\")","v":""},null,null,"Oneri per la sicurezza",{"$f":"Ditte!I6","v":2968}]
[{"$f":"IF(Ditte!A8>=1,Ditte!A8,\"  \")","v":3},0.13844000000000001,{"$f":"IF(Ditte!B8=0,\" \",Ditte!B8)","v":"BERTI SISTO"},{"$f":"IF(Ditte!D8=0,\" \",Ditte!D8)","v":0.13844000000000001},301930.59999999998,0.13844000000000001,0.13844000000000001,{"$f":"IF(G8=$L$13,\"PROPOSTA DI AGGIUDICAZIONE\",\"\")","v":""},null,null,"Lavori sogg. ribasso",{"$f":"L9-L7","v":347001.48}]
[{"$f":"IF(Ditte!A9>=1,Ditte!A9,\"  \")","v":4},0.1401,{"$f":"IF(Ditte!B9=0,\" \",Ditte!B9)","v":"ITALSCAVI SPA"},{"$f":"IF(Ditte!D9=0,\" \",Ditte!D9)","v":0.1401},301354.57,0.1401,0.1401,"",null,null,"Valore appalto",{"$f":"Ditte!I5","v":349969.48}]
[{"$f":"IF(Ditte!A10>=1,Ditte!A10,\"  \")","v":5},0.14132,{"$f":"IF(Ditte!B10=0,\" \",Ditte!B10)","v":"AMBROGETTI SRL"},{"$f":"IF(Ditte!D10=0,\" \",Ditte!D10)","v":0.14132},300931.23,0.14132,0.14132,"",null,null,"Media ribasso valido",{"$f":"AVERAGE(F:F)","v":0.1591158}]
[{"$f":"IF(Ditte!A11>=1,Ditte!A11,\"  \")","v":6},0.15334,{"$f":"IF(Ditte!B11=0,\" \",Ditte!B11)","v":"GAETTI COSTRUZIONI SRL"},{"$f":"IF(Ditte!D11=0,\" \",Ditte!D11)","v":0.15334},296760.27,0.15334,0.15334,"",null,null,"Aumento",0.15]
[{"$f":"IF(Ditte!A12>=1,Ditte!A12,\"  \")","v":7},0.15573000000000001,{"$f":"IF(Ditte!B12=0,\" \",Ditte!B12)","v":"L.S. NORD SRL"},{"$f":"IF(Ditte!D12=0,\" \",Ditte!D12)","v":0.15573000000000001},295930.94,0.15573000000000001,0.15573000000000001,"",null,null,"Soglia anomalia",{"$f":"L10*1.15","v":0.18298320000000001}]
[{"$f":"IF(Ditte!A13>=1,Ditte!A13,\"  \")","v":8},0.15694,{"$f":"IF(Ditte!B13=0,\" \",Ditte!B13)","v":"EDILIZIA DEL COM.BELLI"},{"$f":"IF(Ditte!D13=0,\" \",Ditte!D13)","v":0.15694},295511.07,0.15694,0.15694,"",null,null,"% PROPOSTA DI AGGIUDICAZIONE",{"$f":"MAX(G:G)","v":0.16771}]
[{"$f":"IF(Ditte!A14>=1,Ditte!A14,\"  \")","v":9},0.16098999999999999,{"$f":"IF(Ditte!B14=0,\" \",Ditte!B14)","v":"ZANNINI"},{"$f":"IF(Ditte!D14=0,\" \",Ditte!D14)","v":0.16098999999999999},294105.71000000002,0.16098999999999999,0.16098999999999999,"",null,null,"Nome ditta PROPOSTA DI AGGIUDICAZIONE"]
[{"$f":"IF(Ditte!A15>=1,Ditte!A15,\"  \")","v":10},0.1613,{"$f":"IF(Ditte!B15=0,\" \",Ditte!B15)","v":"COAF SOC.COOP"},{"$f":"IF(Ditte!D15=0,\" \",Ditte!D15)","v":0.1613},293998.14,0.1613,0.1613,"",null,null,{"$f":"IF(COUNTA(H6:H35)-COUNTBLANK(H6:H35)=1,VLOOKUP(L13,B6:C35,2),\"C'E' PIU' DI UNA AGGIUDICAZIONE PROVVISORIA\")","v":"CSA CONS. SERVIZI APPALTI"}]
[{"$f":"IF(Ditte!A16>=1,Ditte!A16,\"  \")","v":11},0.16413,{"$f":"IF(Ditte!B16=0,\" \",Ditte!B16)","v":"CORMA CONS."},{"$f":"IF(Ditte!D16=0,\" \",Ditte!D16)","v":0.16413},293016.13,0.16413,0.16413,""]
[{"$f":"IF(Ditte!A17>=1,Ditte!A17,\"  \")","v":12},0.16771,{"$f":"IF(Ditte!B17=0,\" \",Ditte!B17)","v":"CSA CONS. SERVIZI APPALTI"},{"$f":"IF(Ditte!D17=0,\" \",Ditte!D17)","v":0.16771},291773.86,0.16771,0.16771,"PROPOSTA DI AGGIUDICAZIONE"]
[{"$f":"IF(Ditte!A18>=1,Ditte!A18,\"  \")","v":13},"Anomala",{"$f":"IF(Ditte!B18=0,\" \",Ditte!B18)","v":"CAMAR SOC. COOP."},{"$f":"IF(Ditte!D18=0,\" \",Ditte!D18)","v":0.18551999999999999},285593.77,0.18551999999999999,"Anomala",""]
[{"$f":"IF(Ditte!A19>=1,Ditte!A19,\"  \")","v":14},"Anomala",{"$f":"IF(Ditte!B19=0,\" \",Ditte!B19)","v":"CME "},{"$f":"IF(Ditte!D19=0,\" \",Ditte!D19)","v":0.18887999999999999},284427.84000000003,0.18887999999999999,"Anomala",""]
[{"$f":"IF(Ditte!A20>=1,Ditte!A20,\"  \")","v":15},"Anomala",{"$f":"IF(Ditte!B20=0,\" \",Ditte!B20)","v":"FRATELLI DI CARLO SRL"},{"$f":"IF(Ditte!D20=0,\" \",Ditte!D20)","v":0.19900000000000001},280916.19,0.19900000000000001,"Anomala",""]
[{"$f":"IF(Ditte!A21>=1,Ditte!A21,\"  \")","v":16},"Anomala",{"$f":"IF(Ditte!B21=0,\" \",Ditte!B21)","v":"GRENTI SRL"},{"$f":"IF(Ditte!D21=0,\" \",Ditte!D21)","v":0.19991999999999999},280596.94,0.19991999999999999,"Anomala",""]
[{"$f":"IF(Ditte!A22>=1,Ditte!A22,\"  \")","v":17},"Anomala",{"$f":"IF(Ditte!B22=0,\" \",Ditte!B22)","v":"EDIL DUE SRL"},{"$f":"IF(Ditte!D22=0,\" \",Ditte!D22)","v":0.20250000000000001},279701.68,0.20250000000000001,"Anomala",""]
[{"$f":"IF(Ditte!A23>=1,Ditte!A23,\"  \")","v":18},"Anomala",{"$f":"IF(Ditte!B23=0,\" \",Ditte!B23)","v":"CFC COSTRUZIONI"},{"$f":"IF(Ditte!D23=0,\" \",Ditte!D23)","v":0.21376999999999999},275790.96999999997,0.21376999999999999,"Anomala",""]
[{"$f":"IF(Ditte!A24>=1,Ditte!A24,\"  \")","v":19},"Anomala",{"$f":"IF(Ditte!B24=0,\" \",Ditte!B24)","v":"CIPAR SRL"},{"$f":"IF(Ditte!D24=0,\" \",Ditte!D24)","v":0.22259999999999999},272726.95,0.22259999999999999,"Anomala","",null,null,{"$f":"Ditte!H16","v":"PRESIDENTE DI GARA"}]
[{"$f":"IF(Ditte!A25>=1,Ditte!A25,\"  \")","v":""}," ",{"$f":"IF(Ditte!B25=0,\" \",Ditte!B25)","v":" "},{"$f":"IF(Ditte!D25=0,\" \",Ditte!D25)","v":" "}," "," "," ","",null,null,{"$f":"Ditte!H17","v":"Ing. Francesco Capuano"}]
[{"$f":"IF(Ditte!A26>=1,Ditte!A26,\"  \")","v":""}," ",{"$f":"IF(Ditte!B26=0,\" \",Ditte!B26)","v":" "},{"$f":"IF(Ditte!D26=0,\" \",Ditte!D26)","v":" "}," "," "," ",""]
[{"$f":"IF(Ditte!A27>=1,Ditte!A27,\"  \")","v":""}," ",{"$f":"IF(Ditte!B27=0,\" \",Ditte!B27)","v":" "},{"$f":"IF(Ditte!D27=0,\" \",Ditte!D27)","v":" "}," "," "," ",""]
[{"$f":"IF(Ditte!A28>=1,Ditte!A28,\"  \")","v":""}," ",{"$f":"IF(Ditte!B28=0,\" \",Ditte!B28)","v":" "},{"$f":"IF(Ditte!D28=0,\" \",Ditte!D28)","v":" "}," "," "," ",""]
[{"$f":"IF(Ditte!A29>=1,Ditte!A29,\"  \")","v":""}," ",{"$f":"IF(Ditte!B29=0,\" \",Ditte!B29)","v":" "},{"$f":"IF(Ditte!D29=0,\" \",Ditte!D29)","v":" "}," "," "," ",""]
[{"$f":"IF(Ditte!A30>=1,Ditte!A30,\"  \")","v":""}," ",{"$f":"IF(Ditte!B30=0,\" \",Ditte!B30)","v":" "},{"$f":"IF(Ditte!D30=0,\" \",Ditte!D30)","v":" "}," "," "," ",""]
[{"$f":"IF(Ditte!A31>=1,Ditte!A31,\"  \")","v":""}," ",{"$f":"IF(Ditte!B31=0,\" \",Ditte!B31)","v":" "},{"$f":"IF(Ditte!D31=0,\" \",Ditte!D31)","v":" "}," "," "," ",""]
[{"$f":"IF(Ditte!A32>=1,Ditte!A32,\"  \")","v":""}," ",{"$f":"IF(Ditte!B32=0,\" \",Ditte!B32)","v":" "},{"$f":"IF(Ditte!D32=0,\" \",Ditte!D32)","v":" "}," "," "," ",""]
[{"$f":"IF(Ditte!A33>=1,Ditte!A33,\"  \")","v":""}," ",{"$f":"IF(Ditte!B33=0,\" \",Ditte!B33)","v":" "},{"$f":"IF(Ditte!D33=0,\" \",Ditte!D33)","v":" "}," "," "," ",""]
[{"$f":"IF(Ditte!A34>=1,Ditte!A34,\"  \")","v":""}," ",{"$f":"IF(Ditte!B34=0,\" \",Ditte!B34)","v":" "},{"$f":"IF(Ditte!D34=0,\" \",Ditte!D34)","v":" "}," "," "," ",""]
[{"$f":"IF(Ditte!A35>=1,Ditte!A35,\"  \")","v":""},{"$f":"G35","v":" "},{"$f":"IF(Ditte!B35=0,\" \",Ditte!B35)","v":" "},{"$f":"IF(Ditte!D35=0,\" \",Ditte!D35)","v":" "},{"$f":"IF(D35=\" \",\" \",$L$8*(1-D35)+$L$7)","v":" "},{"$f":"IF(AND(A35>$L$18,A35<=(COUNT($A:$A)-$L$18)),D35,\" \")","v":" "},{"$f":"IF(F35=\" \",\" \",IF(F35<$L$12,F35,\"Anomala\"))","v":" "},{"$f":"IF(G35=$L$13,\"PROPOSTA DI AGGIUDICAZIONE\",\"\")","v":""}]

{"sheet":"Metodo d","index":4,"n_rows":35,"n_cols":12,"rows_kept":35,"cut":false,"hidden":false,"merged":[[1,0,1,11],[14,10,14,11]]}
[null,null,{"$f":"Ditte!B1","v":"INIZIO ORE   10:40"},"Stralcio del verbale di gara",null,null,null,null,null,null,"DATA",{"$f":"Ditte!I1","v":"2017-10-27"}]
[{"$f":"Ditte!A2","v":"LEGGE 191/2009 - TERZO ACCORDO DI PROGRAMMA - COD. 1ER1126 - COMUNE DI VENTASSO (RE) - LAVORI DI CONSOLIDAMENTO E MESSA IN SICUREZZA DEL SETTORE OVEST DEL DISSESTO IDROGEOLOGICO CHE COINVOLGE L'ABITATO DI TAVIANO"}]
[null,null,"Offerte pervenute",{"$f":"Ditte!C3","v":19},null,null,null,null,null,null,{"$f":"Ditte!H12","v":"Estrazione del lotto del"},{"$f":"Ditte!I12","v":"2017-10-26"}]
[null,null,"Offerte regolari ",{"$f":"Ditte!C4","v":19},null,null,null,null,null,null,{"$f":"Ditte!H13","v":"Seme generatore 1° estratto ruota di Bari n."},{"$f":"Ditte!I13","v":16}]
["N",null,"Nome Ditta","Ribasso %","Importo offerto","Valide","Offerte Ammesse",null,null,null,{"$f":"Ditte!H14","v":"Metodo sorteggiato  art. 97 DLGS n. 50/16"},{"$f":"Ditte!I14","v":"B)"}]
[{"$f":"IF(Ditte!A6>=1,Ditte!A6,\"  \")","v":1},{"$f":"G6","v":1.111E-2},{"$f":"IF(Ditte!B6=0,\" \",Ditte!B6)","v":"CEIS SRL"},{"$f":"IF(Ditte!D6=0,\" \",Ditte!D6)","v":1.111E-2},{"$f":"IF(D6=\" \",\" \",$L$8*(1-D6)+$L$7)","v":346114.29},{"$f":"IF(AND(A6>$L$18,A6<=(COUNT($A:$A)-$L$18)),D6,\" \")","v":1.111E-2},{"$f":"IF(F6=\" \",\" \",IF(F6<$L$12,F6,\"Anomala\"))","v":1.111E-2},{"$f":"IF(G6=$L$13,\"PROPOSTA DI AGGIUDICAZIONE\",\"\")","v":""}]
[{"$f":"IF(Ditte!A7>=1,Ditte!A7,\"  \")","v":2},{"$f":"G7","v":5.9900000000000002E-2},{"$f":"IF(Ditte!B7=0,\" \",Ditte!B7)","v":"MONTANA VALLE DEL LAMONE"},{"$f":"IF(Ditte!D7=0,\" \",Ditte!D7)","v":5.9900000000000002E-2},329184.09000000003,5.9900000000000002E-2,{"$f":"IF(F7=\" \",\" \",IF(F7<$L$12,F7,\"Anomala\"))","v":5.9900000000000002E-2},{"$f":"IF(G7=$L$13,\"PROPOSTA DI AGGIUDICAZIONE\",\"\")","v":""},null,null,"Oneri per la sicurezza",{"$f":"Ditte!I6","v":2968}]
[{"$f":"IF(Ditte!A8>=1,Ditte!A8,\"  \")","v":3},0.13844000000000001,{"$f":"IF(Ditte!B8=0,\" \",Ditte!B8)","v":"BERTI SISTO"},{"$f":"IF(Ditte!D8=0,\" \",Ditte!D8)","v":0.13844000000000001},301930.59999999998,0.13844000000000001,0.13844000000000001,{"$f":"IF(G8=$L$13,\"PROPOSTA DI AGGIUDICAZIONE\",\"\")","v":""},null,null,"Lavori sogg. ribasso",{"$f":"L9-L7","v":347001.48}]
[{"$f":"IF(Ditte!A9>=1,Ditte!A9,\"  \")","v":4},0.1401,{"$f":"IF(Ditte!B9=0,\" \",Ditte!B9)","v":"ITALSCAVI SPA"},{"$f":"IF(Ditte!D9=0,\" \",Ditte!D9)","v":0.1401},301354.57,0.1401,0.1401,"",null,null,"Valore appalto",{"$f":"Ditte!I5","v":349969.48}]
[{"$f":"IF(Ditte!A10>=1,Ditte!A10,\"  \")","v":5},0.14132,{"$f":"IF(Ditte!B10=0,\" \",Ditte!B10)","v":"AMBROGETTI SRL"},{"$f":"IF(Ditte!D10=0,\" \",Ditte!D10)","v":0.14132},300931.23,0.14132,0.14132,"",null,null,"Media ribasso valido",{"$f":"AVERAGE(F:F)","v":0.1591158}]
[{"$f":"IF(Ditte!A11>=1,Ditte!A11,\"  \")","v":6},0.15334,{"$f":"IF(Ditte!B11=0,\" \",Ditte!B11)","v":"GAETTI COSTRUZIONI SRL"},{"$f":"IF(Ditte!D11=0,\" \",Ditte!D11)","v":0.15334},296760.27,0.15334,0.15334,"",null,null,"Aumento",0.1]
[{"$f":"IF(Ditte!A12>=1,Ditte!A12,\"  \")","v":7},0.15573000000000001,{"$f":"IF(Ditte!B12=0,\" \",Ditte!B12)","v":"L.S. NORD SRL"},{"$f":"IF(Ditte!D12=0,\" \",Ditte!D12)","v":0.15573000000000001},295930.94,0.15573000000000001,0.15573000000000001,"",null,null,"Soglia anomalia",{"$f":"L10*1.1","v":0.1750274}]
[{"$f":"IF(Ditte!A13>=1,Ditte!A13,\"  \")","v":8},0.15694,{"$f":"IF(Ditte!B13=0,\" \",Ditte!B13)","v":"EDILIZIA DEL COM.BELLI"},{"$f":"IF(Ditte!D13=0,\" \",Ditte!D13)","v":0.15694},295511.07,0.15694,0.15694,"",null,null,"% PROPOSTA DI AGGIUDICAZIONE",{"$f":"MAX(G:G)","v":0.16771}]
[{"$f":"IF(Ditte!A14>=1,Ditte!A14,\"  \")","v":9},0.16098999999999999,{"$f":"IF(Ditte!B14=0,\" \",Ditte!B14)","v":"ZANNINI"},{"$f":"IF(Ditte!D14=0,\" \",Ditte!D14)","v":0.16098999999999999},294105.71000000002,0.16098999999999999,0.16098999999999999,"",null,null,"Nome ditta PROPOSTA DI AGGIUDICAZIONE"]
[{"$f":"IF(Ditte!A15>=1,Ditte!A15,\"  \")","v":10},0.1613,{"$f":"IF(Ditte!B15=0,\" \",Ditte!B15)","v":"COAF SOC.COOP"},{"$f":"IF(Ditte!D15=0,\" \",Ditte!D15)","v":0.1613},293998.14,0.1613,0.1613,"",null,null,{"$f":"IF(COUNTA(H6:H35)-COUNTBLANK(H6:H35)=1,VLOOKUP(L13,B6:C35,2),\"C'E' PIU' DI UNA AGGIUDICAZIONE PROVVISORIA\")","v":"CSA CONS. SERVIZI APPALTI"}]
[{"$f":"IF(Ditte!A16>=1,Ditte!A16,\"  \")","v":11},0.16413,{"$f":"IF(Ditte!B16=0,\" \",Ditte!B16)","v":"CORMA CONS."},{"$f":"IF(Ditte!D16=0,\" \",Ditte!D16)","v":0.16413},293016.13,0.16413,0.16413,""]
[{"$f":"IF(Ditte!A17>=1,Ditte!A17,\"  \")","v":12},0.16771,{"$f":"IF(Ditte!B17=0,\" \",Ditte!B17)","v":"CSA CONS. SERVIZI APPALTI"},{"$f":"IF(Ditte!D17=0,\" \",Ditte!D17)","v":0.16771},291773.86,0.16771,0.16771,"PROPOSTA DI AGGIUDICAZIONE"]
[{"$f":"IF(Ditte!A18>=1,Ditte!A18,\"  \")","v":13},"Anomala",{"$f":"IF(Ditte!B18=0,\" \",Ditte!B18)","v":"CAMAR SOC. COOP."},{"$f":"IF(Ditte!D18=0,\" \",Ditte!D18)","v":0.18551999999999999},285593.77,0.18551999999999999,"Anomala",""]
[{"$f":"IF(Ditte!A19>=1,Ditte!A19,\"  \")","v":14},"Anomala",{"$f":"IF(Ditte!B19=0,\" \",Ditte!B19)","v":"CME "},{"$f":"IF(Ditte!D19=0,\" \",Ditte!D19)","v":0.18887999999999999},284427.84000000003,0.18887999999999999,"Anomala",""]
[{"$f":"IF(Ditte!A20>=1,Ditte!A20,\"  \")","v":15},"Anomala",{"$f":"IF(Ditte!B20=0,\" \",Ditte!B20)","v":"FRATELLI DI CARLO SRL"},{"$f":"IF(Ditte!D20=0,\" \",Ditte!D20)","v":0.19900000000000001},280916.19,0.19900000000000001,"Anomala",""]
[{"$f":"IF(Ditte!A21>=1,Ditte!A21,\"  \")","v":16},"Anomala",{"$f":"IF(Ditte!B21=0,\" \",Ditte!B21)","v":"GRENTI SRL"},{"$f":"IF(Ditte!D21=0,\" \",Ditte!D21)","v":0.19991999999999999},280596.94,0.19991999999999999,"Anomala",""]
[{"$f":"IF(Ditte!A22>=1,Ditte!A22,\"  \")","v":17},"Anomala",{"$f":"IF(Ditte!B22=0,\" \",Ditte!B22)","v":"EDIL DUE SRL"},{"$f":"IF(Ditte!D22=0,\" \",Ditte!D22)","v":0.20250000000000001},279701.68,0.20250000000000001,"Anomala",""]
[{"$f":"IF(Ditte!A23>=1,Ditte!A23,\"  \")","v":18},"Anomala",{"$f":"IF(Ditte!B23=0,\" \",Ditte!B23)","v":"CFC COSTRUZIONI"},{"$f":"IF(Ditte!D23=0,\" \",Ditte!D23)","v":0.21376999999999999},275790.96999999997,0.21376999999999999,"Anomala",""]
[{"$f":"IF(Ditte!A24>=1,Ditte!A24,\"  \")","v":19},"Anomala",{"$f":"IF(Ditte!B24=0,\" \",Ditte!B24)","v":"CIPAR SRL"},{"$f":"IF(Ditte!D24=0,\" \",Ditte!D24)","v":0.22259999999999999},272726.95,0.22259999999999999,"Anomala","",null,null,{"$f":"Ditte!H16","v":"PRESIDENTE DI GARA"}]
[{"$f":"IF(Ditte!A25>=1,Ditte!A25,\"  \")","v":""}," ",{"$f":"IF(Ditte!B25=0,\" \",Ditte!B25)","v":" "},{"$f":"IF(Ditte!D25=0,\" \",Ditte!D25)","v":" "}," "," "," ","",null,null,{"$f":"Ditte!H17","v":"Ing. Francesco Capuano"}]
[{"$f":"IF(Ditte!A26>=1,Ditte!A26,\"  \")","v":""}," ",{"$f":"IF(Ditte!B26=0,\" \",Ditte!B26)","v":" "},{"$f":"IF(Ditte!D26=0,\" \",Ditte!D26)","v":" "}," "," "," ",""]
[{"$f":"IF(Ditte!A27>=1,Ditte!A27,\"  \")","v":""}," ",{"$f":"IF(Ditte!B27=0,\" \",Ditte!B27)","v":" "},{"$f":"IF(Ditte!D27=0,\" \",Ditte!D27)","v":" "}," "," "," ",""]
[{"$f":"IF(Ditte!A28>=1,Ditte!A28,\"  \")","v":""}," ",{"$f":"IF(Ditte!B28=0,\" \",Ditte!B28)","v":" "},{"$f":"IF(Ditte!D28=0,\" \",Ditte!D28)","v":" "}," "," "," ",""]
[{"$f":"IF(Ditte!A29>=1,Ditte!A29,\"  \")","v":""}," ",{"$f":"IF(Ditte!B29=0,\" \",Ditte!B29)","v":" "},{"$f":"IF(Ditte!D29=0,\" \",Ditte!D29)","v":" "}," "," "," ",""]
[{"$f":"IF(Ditte!A30>=1,Ditte!A30,\"  \")","v":""}," ",{"$f":"IF(Ditte!B30=0,\" \",Ditte!B30)","v":" "},{"$f":"IF(Ditte!D30=0,\" \",Ditte!D30)","v":" "}," "," "," ",""]
[{"$f":"IF(Ditte!A31>=1,Ditte!A31,\"  \")","v":""}," ",{"$f":"IF(Ditte!B31=0,\" \",Ditte!B31)","v":" "},{"$f":"IF(Ditte!D31=0,\" \",Ditte!D31)","v":" "}," "," "," ",""]
[{"$f":"IF(Ditte!A32>=1,Ditte!A32,\"  \")","v":""}," ",{"$f":"IF(Ditte!B32=0,\" \",Ditte!B32)","v":" "},{"$f":"IF(Ditte!D32=0,\" \",Ditte!D32)","v":" "}," "," "," ",""]
[{"$f":"IF(Ditte!A33>=1,Ditte!A33,\"  \")","v":""}," ",{"$f":"IF(Ditte!B33=0,\" \",Ditte!B33)","v":" "},{"$f":"IF(Ditte!D33=0,\" \",Ditte!D33)","v":" "}," "," "," ",""]
[{"$f":"IF(Ditte!A34>=1,Ditte!A34,\"  \")","v":""}," ",{"$f":"IF(Ditte!B34=0,\" \",Ditte!B34)","v":" "},{"$f":"IF(Ditte!D34=0,\" \",Ditte!D34)","v":" "}," "," "," ",""]
[{"$f":"IF(Ditte!A35>=1,Ditte!A35,\"  \")","v":""},{"$f":"G35","v":" "},{"$f":"IF(Ditte!B35=0,\" \",Ditte!B35)","v":" "},{"$f":"IF(Ditte!D35=0,\" \",Ditte!D35)","v":" "},{"$f":"IF(D35=\" \",\" \",$L$8*(1-D35)+$L$7)","v":" "},{"$f":"IF(AND(A35>$L$18,A35<=(COUNT($A:$A)-$L$18)),D35,\" \")","v":" "},{"$f":"IF(F35=\" \",\" \",IF(F35<$L$12,F35,\"Anomala\"))","v":" "},{"$f":"IF(G35=$L$13,\"PROPOSTA DI AGGIUDICAZIONE\",\"\")","v":""}]

{"sheet":"Metodo e","index":5,"n_rows":35,"n_cols":13,"rows_kept":35,"cut":false,"hidden":false,"merged":[[1,0,1,12],[16,11,16,12]]}
[null,null,{"$f":"Ditte!B1","v":"INIZIO ORE   10:40"},"Stralcio del verbale di gara",null,null,null,null,null,null,null,"DATA",{"$f":"Ditte!I1","v":"2017-10-27"}]
[{"$f":"Ditte!A2","v":"LEGGE 191/2009 - TERZO ACCORDO DI PROGRAMMA - COD. 1ER1126 - COMUNE DI VENTASSO (RE) - LAVORI DI CONSOLIDAMENTO E MESSA IN SICUREZZA DEL SETTORE OVEST DEL DISSESTO IDROGEOLOGICO CHE COINVOLGE L'ABITATO DI TAVIANO"}]
[null,null,"Offerte pervenute",{"$f":"Ditte!C3","v":19},null,null,null,null,null,null,null,{"$f":"Ditte!H12","v":"Estrazione del lotto del"},{"$f":"Ditte!I12","v":"2017-10-26"}]
[null,null,"Offerte regolari ",{"$f":"Ditte!C4","v":19},null,null,null,null,null,null,null,{"$f":"Ditte!H13","v":"Seme generatore 1° estratto ruota di Bari n."},{"$f":"Ditte!I13","v":16}]
["N",null,"Nome Ditta","Ribasso %","Importo offerto","Valide","Scostamento","Offerte Ammesse",null,null,null,{"$f":"Ditte!H14","v":"Metodo sorteggiato  art. 97 DLGS n. 50/16"},{"$f":"Ditte!I14","v":"B)"}]
[{"$f":"IF(Ditte!A6>=1,Ditte!A6,\"  \")","v":1},{"$f":"H6","v":" "},{"$f":"IF(Ditte!B6=0,\" \",Ditte!B6)","v":"CEIS SRL"},{"$f":"IF(Ditte!D6=0,\" \",Ditte!D6)","v":1.111E-2},{"$f":"IF(D6=\" \",\" \",$M$8*(1-D6)+$M$7)","v":346114.29},{"$f":"IF(AND(A6>$M$19,A6<=(COUNT($A:$A)-$M$19)),D6,\" \")","v":" "},{"$f":"IF(F6=\" \",\" \",IF(F6>=MediaR,F6-MediaR,\"\"))","v":" "},{"$f":"IF(F6=\" \",\" \",IF(F6<$M$14,F6,\"Anomala\"))","v":" "},{"$f":"IF(H6=$M$15,\"PROPOSTA DI AGGIUDICAZIONE\",\"\")","v":""}]
[{"$f":"IF(Ditte!A7>=1,Ditte!A7,\"  \")","v":2},{"$f":"H7","v":" "},{"$f":"IF(Ditte!B7=0,\" \",Ditte!B7)","v":"MONTANA VALLE DEL LAMONE"},{"$f":"IF(Ditte!D7=0,\" \",Ditte!D7)","v":5.9900000000000002E-2},329184.09000000003,{"$f":"IF(AND(A7>$M$19,A7<=(COUNT($A:$A)-$M$19)),D7,\" \")","v":" "}," "," ",{"$f":"IF(H7=$M$15,\"PROPOSTA DI AGGIUDICAZIONE\",\"\")","v":""},null,null,"Oneri per la sicurezza",{"$f":"Ditte!I6","v":2968}]
[{"$f":"IF(Ditte!A8>=1,Ditte!A8,\"  \")","v":3},0.13844000000000001,{"$f":"IF(Ditte!B8=0,\" \",Ditte!B8)","v":"BERTI SISTO"},{"$f":"IF(Ditte!D8=0,\" \",Ditte!D8)","v":0.13844000000000001},301930.59999999998,{"$f":"IF(AND(A8>$M$19,A8<=(COUNT($A:$A)-$M$19)),D8,\" \")","v":0.13844000000000001},"",0.13844000000000001,{"$f":"IF(H8=$M$15,\"PROPOSTA DI AGGIUDICAZIONE\",\"\")","v":""},null,null,"Lavori sogg. ribasso",{"$f":"M9-M7","v":347001.48}]
[{"$f":"IF(Ditte!A9>=1,Ditte!A9,\"  \")","v":4},0.1401,{"$f":"IF(Ditte!B9=0,\" \",Ditte!B9)","v":"ITALSCAVI SPA"},{"$f":"IF(Ditte!D9=0,\" \",Ditte!D9)","v":0.1401},301354.57,0.1401,"",0.1401,{"$f":"IF(H9=$M$15,\"PROPOSTA DI AGGIUDICAZIONE\",\"\")","v":""},null,null,"Valore appalto",{"$f":"Ditte!I5","v":349969.48}]
[{"$f":"IF(Ditte!A10>=1,Ditte!A10,\"  \")","v":5},0.14132,{"$f":"IF(Ditte!B10=0,\" \",Ditte!B10)","v":"AMBROGETTI SRL"},{"$f":"IF(Ditte!D10=0,\" \",Ditte!D10)","v":0.14132},300931.23,0.14132,"",0.14132,"",null,null,"Media ribasso valido",{"$f":"AVERAGE(F:F)","v":0.16772129999999999}]
[{"$f":"IF(Ditte!A11>=1,Ditte!A11,\"  \")","v":6},0.15334,{"$f":"IF(Ditte!B11=0,\" \",Ditte!B11)","v":"GAETTI COSTRUZIONI SRL"},{"$f":"IF(Ditte!D11=0,\" \",Ditte!D11)","v":0.15334},296760.27,0.15334,"",0.15334,"",null,null,"Media scostamenti",{"$f":"AVERAGE(G:G)","v":2.37828E-2}]
[{"$f":"IF(Ditte!A12>=1,Ditte!A12,\"  \")","v":7},0.15573000000000001,{"$f":"IF(Ditte!B12=0,\" \",Ditte!B12)","v":"L.S. NORD SRL"},{"$f":"IF(Ditte!D12=0,\" \",Ditte!D12)","v":0.15573000000000001},295930.94,0.15573000000000001,"",0.15573000000000001,"",null,null,"Coefficiente*",{"$f":"M21","v":0.9}]
[{"$f":"IF(Ditte!A13>=1,Ditte!A13,\"  \")","v":8},0.15694,{"$f":"IF(Ditte!B13=0,\" \",Ditte!B13)","v":"EDILIZIA DEL COM.BELLI"},{"$f":"IF(Ditte!D13=0,\" \",Ditte!D13)","v":0.15694},295511.07,0.15694,"",0.15694,"",null,null,"Media scostamenti modificata",{"$f":"M11*M12","v":2.14045E-2}]
[{"$f":"IF(Ditte!A14>=1,Ditte!A14,\"  \")","v":9},0.16098999999999999,{"$f":"IF(Ditte!B14=0,\" \",Ditte!B14)","v":"ZANNINI"},{"$f":"IF(Ditte!D14=0,\" \",Ditte!D14)","v":0.16098999999999999},294105.71000000002,0.16098999999999999,"",0.16098999999999999,"",null,null,"Soglia anomalia",{"$f":"M10+M13","v":0.18912580000000001}]
[{"$f":"IF(Ditte!A15>=1,Ditte!A15,\"  \")","v":10},0.1613,{"$f":"IF(Ditte!B15=0,\" \",Ditte!B15)","v":"COAF SOC.COOP"},{"$f":"IF(Ditte!D15=0,\" \",Ditte!D15)","v":0.1613},293998.14,0.1613,"",0.1613,"",null,null,"% PROPOSTA DI AGGIUDICAZIONE",{"$f":"MAX(H:H)","v":0.18887999999999999}]
[{"$f":"IF(Ditte!A16>=1,Ditte!A16,\"  \")","v":11},0.16413,{"$f":"IF(Ditte!B16=0,\" \",Ditte!B16)","v":"CORMA CONS."},{"$f":"IF(Ditte!D16=0,\" \",Ditte!D16)","v":0.16413},293016.13,0.16413,"",0.16413,"",null,null,"Nome ditta PROPOSTA DI AGGIUDICAZIONE"]
[{"$f":"IF(Ditte!A17>=1,Ditte!A17,\"  \")","v":12},0.16771,{"$f":"IF(Ditte!B17=0,\" \",Ditte!B17)","v":"CSA CONS. SERVIZI APPALTI"},{"$f":"IF(Ditte!D17=0,\" \",Ditte!D17)","v":0.16771},291773.86,0.16771,9.0450000000000003E-4,0.16771,"",null,null,{"$f":"IF(COUNTA(I6:I35)-COUNTBLANK(I6:I35)=1,VLOOKUP(M15,B6:C35,2),\"C'E' PIU' DI UNA AGGIUDICAZIONE PROVVISORIA\")","v":"CME "}]
[{"$f":"IF(Ditte!A18>=1,Ditte!A18,\"  \")","v":13},0.18551999999999999,{"$f":"IF(Ditte!B18=0,\" \",Ditte!B18)","v":"CAMAR SOC. COOP."},{"$f":"IF(Ditte!D18=0,\" \",Ditte!D18)","v":0.18551999999999999},285593.77,0.18551999999999999,1.8714499999999998E-2,0.18551999999999999,""]
[{"$f":"IF(Ditte!A19>=1,Ditte!A19,\"  \")","v":14},0.18887999999999999,{"$f":"IF(Ditte!B19=0,\" \",Ditte!B19)","v":"CME "},{"$f":"IF(Ditte!D19=0,\" \",Ditte!D19)","v":0.18887999999999999},284427.84000000003,0.18887999999999999,2.20745E-2,0.18887999999999999,"PROPOSTA DI AGGIUDICAZIONE",null,null,"ALI     N.",{"$f":"CEILING(0.1*COUNT(A:A),1)","v":2}]
[{"$f":"IF(Ditte!A20>=1,Ditte!A20,\"  \")","v":15},"Anomala",{"$f":"IF(Ditte!B20=0,\" \",Ditte!B20)","v":"FRATELLI DI CARLO SRL"},{"$f":"IF(Ditte!D20=0,\" \",Ditte!D20)","v":0.19900000000000001},280916.19,0.19900000000000001,3.2194500000000001E-2,"Anomala","",null,null,"* Valori coefficiente: 0,6; 0,7; 0,8; 0,9"]
[{"$f":"IF(Ditte!A21>=1,Ditte!A21,\"  \")","v":16},"Anomala",{"$f":"IF(Ditte!B21=0,\" \",Ditte!B21)","v":"GRENTI SRL"},{"$f":"IF(Ditte!D21=0,\" \",Ditte!D21)","v":0.19991999999999999},280596.94,0.19991999999999999,3.3114499999999998E-2,"Anomala","",null,null,"Sorteggiato il valore",0.9]
[{"$f":"IF(Ditte!A22>=1,Ditte!A22,\"  \")","v":17},"Anomala",{"$f":"IF(Ditte!B22=0,\" \",Ditte!B22)","v":"EDIL DUE SRL"},{"$f":"IF(Ditte!D22=0,\" \",Ditte!D22)","v":0.20250000000000001},279701.68,0.20250000000000001,3.5694499999999997E-2,"Anomala",""]
[{"$f":"IF(Ditte!A23>=1,Ditte!A23,\"  \")","v":18}," ",{"$f":"IF(Ditte!B23=0,\" \",Ditte!B23)","v":"CFC COSTRUZIONI"},{"$f":"IF(Ditte!D23=0,\" \",Ditte!D23)","v":0.21376999999999999},275790.96999999997," "," "," ",""]
[{"$f":"IF(Ditte!A24>=1,Ditte!A24,\"  \")","v":19}," ",null,{"$f":"IF(Ditte!D24=0,\" \",Ditte!D24)","v":0.22259999999999999},272726.95," "," "," ","",null,null,{"$f":"Ditte!H16","v":"PRESIDENTE DI GARA"}]
[{"$f":"IF(Ditte!A25>=1,Ditte!A25,\"  \")","v":""}," ",{"$f":"IF(Ditte!B25=0,\" \",Ditte!B25)","v":" "},{"$f":"IF(Ditte!D25=0,\" \",Ditte!D25)","v":" "}," "," "," "," ","",null,null,{"$f":"Ditte!H17","v":"Ing. Francesco Capuano"}]
[{"$f":"IF(Ditte!A26>=1,Ditte!A26,\"  \")","v":""}," ",{"$f":"IF(Ditte!B26=0,\" \",Ditte!B26)","v":" "},{"$f":"IF(Ditte!D26=0,\" \",Ditte!D26)","v":" "}," "," "," "," ",""]
[{"$f":"IF(Ditte!A27>=1,Ditte!A27,\"  \")","v":""}," ",{"$f":"IF(Ditte!B27=0,\" \",Ditte!B27)","v":" "},{"$f":"IF(Ditte!D27=0,\" \",Ditte!D27)","v":" "}," "," "," "," ",""]
[{"$f":"IF(Ditte!A28>=1,Ditte!A28,\"  \")","v":""}," ",{"$f":"IF(Ditte!B28=0,\" \",Ditte!B28)","v":" "},{"$f":"IF(Ditte!D28=0,\" \",Ditte!D28)","v":" "}," "," "," "," ",""]
[{"$f":"IF(Ditte!A29>=1,Ditte!A29,\"  \")","v":""}," ",{"$f":"IF(Ditte!B29=0,\" \",Ditte!B29)","v":" "},{"$f":"IF(Ditte!D29=0,\" \",Ditte!D29)","v":" "}," "," "," "," ",""]
[{"$f":"IF(Ditte!A30>=1,Ditte!A30,\"  \")","v":""}," ",{"$f":"IF(Ditte!B30=0,\" \",Ditte!B30)","v":" "},{"$f":"IF(Ditte!D30=0,\" \",Ditte!D30)","v":" "}," "," "," "," ",""]
[{"$f":"IF(Ditte!A31>=1,Ditte!A31,\"  \")","v":""}," ",{"$f":"IF(Ditte!B31=0,\" \",Ditte!B31)","v":" "},{"$f":"IF(Ditte!D31=0,\" \",Ditte!D31)","v":" "}," "," "," "," ",""]
[{"$f":"IF(Ditte!A32>=1,Ditte!A32,\"  \")","v":""}," ",{"$f":"IF(Ditte!B32=0,\" \",Ditte!B32)","v":" "},{"$f":"IF(Ditte!D32=0,\" \",Ditte!D32)","v":" "}," "," "," "," ",""]
[{"$f":"IF(Ditte!A33>=1,Ditte!A33,\"  \")","v":""}," ",{"$f":"IF(Ditte!B33=0,\" \",Ditte!B33)","v":" "},{"$f":"IF(Ditte!D33=0,\" \",Ditte!D33)","v":" "}," "," "," "," ",""]
[{"$f":"IF(Ditte!A34>=1,Ditte!A34,\"  \")","v":""}," ",{"$f":"IF(Ditte!B34=0,\" \",Ditte!B34)","v":" "},{"$f":"IF(Ditte!D34=0,\" \",Ditte!D34)","v":" "}," "," "," "," ",""]
[{"$f":"IF(Ditte!A35>=1,Ditte!A35,\"  \")","v":""},{"$f":"H35","v":" "},{"$f":"IF(Ditte!B35=0,\" \",Ditte!B35)","v":" "},{"$f":"IF(Ditte!D35=0,\" \",Ditte!D35)","v":" "},{"$f":"IF(D35=\" \",\" \",$M$8*(1-D35)+$M$7)","v":" "},{"$f":"IF(AND(A35>$M$19,A35<=(COUNT($A:$A)-$M$19)),D35,\" \")","v":" "},{"$f":"IF(F35=\" \",\" \",IF(F35>=MediaR,F35-MediaR,\"\"))","v":" "},{"$f":"IF(F35=\" \",\" \",IF(F35<$M$14,F35,\"Anomala\"))","v":" "},{"$f":"IF(H35=$M$15,\"PROPOSTA DI AGGIUDICAZIONE\",\"\")","v":""}]

{"sheet":"Max Rib","index":6,"n_rows":17,"n_cols":12,"rows_kept":17,"cut":false,"hidden":false,"merged":[[1,0,1,11],[12,10,12,11]]}
[null,null,{"$f":"Ditte!B1","v":"INIZIO ORE   10:40"},"Stralcio del verbale di gara",null,null,null,null,null,null,"DATA",{"$f":"Ditte!I1","v":"2017-10-27"}]
[{"$f":"Ditte!A2","v":"LEGGE 191/2009 - TERZO ACCORDO DI PROGRAMMA - COD. 1ER1126 - COMUNE DI VENTASSO (RE) - LAVORI DI CONSOLIDAMENTO E MESSA IN SICUREZZA DEL SETTORE OVEST DEL DISSESTO IDROGEOLOGICO CHE COINVOLGE L'ABITATO DI TAVIANO"}]
[null,null,"Offerte pervenute",{"$f":"Ditte!C3","v":19}]
[null,null,"Offerte regolari ",{"$f":"Ditte!C4","v":19}]
["N",null,"Nome Ditta","Ribasso %","Importo offerto","Valide","Offerte Ammesse"]
[{"$f":"IF(Ditte!A6>=1,Ditte!A6,\"  \")","v":1},{"$f":"G6","v":1.111E-2},{"$f":"IF(Ditte!B6=0,\" \",Ditte!B6)","v":"CEIS SRL"},{"$f":"IF(Ditte!D6=0,\" \",Ditte!D6)","v":1.111E-2},{"$f":"IF(D6=\" \",\" \",$L$8*(1-D6)+$L$7)","v":346114.29},{"$f":"IF(AND(A6>$L$18,A6<=(COUNT($A:$A)-$L$18)),D6,\" \")","v":1.111E-2},{"$f":"IF(F6=\" \",\" \",IF(F6<=$L$10,F6,\"Anomala\"))","v":1.111E-2},{"$f":"IF(G6=$L$11,\"PROPOSTA DI AGGIUDICAZIONE\",\"\")","v":""}]
[{"$f":"IF(Ditte!A7>=1,Ditte!A7,\"  \")","v":2},{"$f":"G7","v":5.9900000000000002E-2},{"$f":"IF(Ditte!B7=0,\" \",Ditte!B7)","v":"MONTANA VALLE DEL LAMONE"},{"$f":"IF(Ditte!D7=0,\" \",Ditte!D7)","v":5.9900000000000002E-2},329184.09000000003,5.9900000000000002E-2,{"$f":"IF(F7=\" \",\" \",IF(F7<=$L$10,F7,\"Anomala\"))","v":5.9900000000000002E-2},"",null,null,"Oneri per la sicurezza",{"$f":"Ditte!I6","v":2968}]
[{"$f":"IF(Ditte!A8>=1,Ditte!A8,\"  \")","v":3},0.13844000000000001,{"$f":"IF(Ditte!B8=0,\" \",Ditte!B8)","v":"BERTI SISTO"},{"$f":"IF(Ditte!D8=0,\" \",Ditte!D8)","v":0.13844000000000001},301930.59999999998,0.13844000000000001,0.13844000000000001,"",null,null,"Lavori sogg. ribasso",{"$f":"L9-L7","v":347001.48}]
[{"$f":"IF(Ditte!A9>=1,Ditte!A9,\"  \")","v":4},0.1401,{"$f":"IF(Ditte!B9=0,\" \",Ditte!B9)","v":"ITALSCAVI SPA"},{"$f":"IF(Ditte!D9=0,\" \",Ditte!D9)","v":0.1401},301354.57,0.1401,0.1401,"",null,null,"Valore appalto",{"$f":"Ditte!I5","v":349969.48}]
[{"$f":"IF(Ditte!A10>=1,Ditte!A10,\"  \")","v":5},0.14132,{"$f":"IF(Ditte!B10=0,\" \",Ditte!B10)","v":"AMBROGETTI SRL"},{"$f":"IF(Ditte!D10=0,\" \",Ditte!D10)","v":0.14132},300931.23,0.14132,0.14132,"",null,null,"Massimo ribasso valido",{"$f":"MAX(F:F)","v":0.1613}]
[{"$f":"IF(Ditte!A11>=1,Ditte!A11,\"  \")","v":6},0.15334,{"$f":"IF(Ditte!B11=0,\" \",Ditte!B11)","v":"GAETTI COSTRUZIONI SRL"},{"$f":"IF(Ditte!D11=0,\" \",Ditte!D11)","v":0.15334},296760.27,0.15334,0.15334,"",null,null,"% PROPOSTA DI AGGIUDICAZIONE",{"$f":"$L$10","v":0.1613}]
[{"$f":"IF(Ditte!A12>=1,Ditte!A12,\"  \")","v":7},0.15573000000000001,{"$f":"IF(Ditte!B12=0,\" \",Ditte!B12)","v":"L.S. NORD SRL"},{"$f":"IF(Ditte!D12=0,\" \",Ditte!D12)","v":0.15573000000000001},295930.94,0.15573000000000001,0.15573000000000001,"",null,null,"Nome ditta PROPOSTA DI AGGIUDICAZIONE"]
[{"$f":"IF(Ditte!A13>=1,Ditte!A13,\"  \")","v":8},0.15694,{"$f":"IF(Ditte!B13=0,\" \",Ditte!B13)","v":"EDILIZIA DEL COM.BELLI"},{"$f":"IF(Ditte!D13=0,\" \",Ditte!D13)","v":0.15694},295511.07,0.15694,0.15694,"",null,null,{"$f":"IF(COUNTA(H6:H15)-COUNTBLANK(H6:H15)=1,VLOOKUP(L11,B6:C15,2),\"C'E' PIU' DI UNA AGGIUDICAZIONE PROVVISORIA\")","v":"COAF SOC.COOP"}]
[{"$f":"IF(Ditte!A14>=1,Ditte!A14,\"  \")","v":9},0.16098999999999999,{"$f":"IF(Ditte!B14=0,\" \",Ditte!B14)","v":"ZANNINI"},{"$f":"IF(Ditte!D14=0,\" \",Ditte!D14)","v":0.16098999999999999},294105.71000000002,0.16098999999999999,0.16098999999999999,""]
[{"$f":"IF(Ditte!A15>=1,Ditte!A15,\"  \")","v":10},0.1613,{"$f":"IF(Ditte!B15=0,\" \",Ditte!B15)","v":"COAF SOC.COOP"},{"$f":"IF(Ditte!D15=0,\" \",Ditte!D15)","v":0.1613},293998.14,0.1613,0.1613,"PROPOSTA DI AGGIUDICAZIONE"]
[null,null,null,null,null,null,null,null,null,null,{"$f":"Ditte!H16","v":"PRESIDENTE DI GARA"}]
[null,null,null,null,null,null,null,null,null,null,{"$f":"Ditte!H17","v":"Ing. Francesco Capuano"}]